Target
Apelin receptor
Ligand
BDBM54827
Substrate
Meas. Tech.
Dose Response confirmation of uHTS hits from a small molecule antagonists of the APJ receptor via a luminescent beta-arrestin assay
IC50
2850±n/a nM
Citation
 PubChem, PC Dose Response confirmation of uHTS hits from a small molecule antagonists of the APJ receptor via a luminescent beta-arrestin assay PubChem Bioassay (2010)[AID] 
Target
Name:
Apelin receptor
Synonyms:
AGTRL1 APJ_HUMAN Angiotensin receptor-like 1 Apelin receptor (APJ) G-protein coupled receptor HG11
Type:
Enzyme Catalytic Domain
Mol. Mass.:
42664.06
Organism:
Homo sapiens (Human)
Description:
P35414
Residue:
380
  
Inhibitor
Name:
BDBM54827
Synonyms:
Bis(helenalinyl) malonate SMR000445629 bis[(3aR,5R,5aR,8aR,9S,9aR)-5,8a-dimethyl-1-methylidene-2,8-dioxo-3a,4,5,5a,9,9a-hexahydroazuleno[6,5-b]furan-9-yl] propanedioate malonic acid bis[(3aR,5R,5aR,8aR,9S,9aR)-2,8-diketo-5,8a-dimethyl-1-methylene-3a,4,5,5a,9,9a-hexahydroazuleno[6,5-b]furan-9-yl] ester | propanedioic acid bis[(3aR,5R,5aR,8aR,9S,9aR)-5,8a-dimethyl-1-methylene-2,8-dioxo-3a,4,5,5a,9,9a-hexahydroazuleno[6,5-b]furan-9-yl] ester
Type:
Small organic molecule
Emp. Form.:
C33H36O10
Mol. Mass.:
592.6329
SMILES:
C[C@@H]1C[C@H]2OC(=O)C(=C)[C@H]2[C@H](OC(=O)CC(=O)O[C@H]2[C@H]3[C@@H](C[C@@H](C)[C@@H]4C=CC(=O)[C@@]24C)OC(=O)C3=C)[C@@]2(C)[C@H]1C=CC2=O
: