Target
Apelin receptor
Ligand
BDBM60286
Substrate
Meas. Tech.
Dose Response confirmation of uHTS hits from a small molecule antagonists of the APJ receptor via a luminescent beta-arrestin assay
IC50
3430±n/a nM
Citation
 PubChem, PC Dose Response confirmation of uHTS hits from a small molecule antagonists of the APJ receptor via a luminescent beta-arrestin assay PubChem Bioassay (2010)[AID] 
Target
Name:
Apelin receptor
Synonyms:
AGTRL1 APJ_HUMAN Angiotensin receptor-like 1 Apelin receptor (APJ) G-protein coupled receptor HG11
Type:
Enzyme Catalytic Domain
Mol. Mass.:
42664.06
Organism:
Homo sapiens (Human)
Description:
P35414
Residue:
380
  
Inhibitor
Name:
BDBM60286
Synonyms:
3-bromanyl-N-(1-pyridin-2-ylethylideneamino)benzamide 3-bromo-N-[1-(2-pyridinyl)ethylideneamino]benzamide MLS001232242 cid_872813
Type:
Small organic molecule
Emp. Form.:
C14H12BrN3O
Mol. Mass.:
318.169
SMILES:
CC(=NNC(=O)c1cccc(Br)c1)c1ccccn1
: