Target
G-protein coupled receptor 35
Ligand
BDBM65735
Substrate
Meas. Tech.
SAR analysis of NF-kappaB dependent luciferase using Doxorucibin as an inducer - Set 2
IC50
5939±614 nM
Citation
 PubChem, PC SAR analysis of NF-kappaB dependent luciferase using Doxorucibin as an inducer - Set 2 PubChem Bioassay (2010)[AID] 
Target
Name:
G-protein coupled receptor 35
Synonyms:
G protein-coupled receptor 35 GPR35_HUMAN
Type:
Enzyme Catalytic Domain
Mol. Mass.:
34085.57
Organism:
Homo sapiens (Human)
Description:
gi_33695097
Residue:
309
  
Inhibitor
Name:
BDBM65735
Synonyms:
7-butyl-8-[[4-(3-chlorophenyl)-1-piperazinyl]methyl]-1,3-dimethylpurine-2,6-dione 7-butyl-8-[[4-(3-chlorophenyl)piperazin-1-yl]methyl]-1,3-dimethylpurine-2,6-dione MLS-0004183.0001 | cid_666267
Type:
Small organic molecule
Emp. Form.:
C22H29ClN6O2
Mol. Mass.:
444.958
SMILES:
CCCCn1c(CN2CCN(CC2)c2cccc(Cl)c2)nc2n(C)c(=O)n(C)c(=O)c12
: