Target
Nucleotide-binding oligomerization domain-containing protein 1
Ligand
BDBM67402
Substrate
Meas. Tech.
SAR analysis of compounds that inhibit NOD1 - Set 3
IC50
>20000±n/a nM
Citation
 PubChem, PC SAR analysis of compounds that inhibit NOD1 - Set 3 PubChem Bioassay (2010)[AID] 
Target
Name:
Nucleotide-binding oligomerization domain-containing protein 1
Synonyms:
CARD4 NOD1_HUMAN | nucleotide-binding oligomerization domain containing 1
Type:
Enzyme Catalytic Domain
Mol. Mass.:
107699.03
Organism:
Homo sapiens (Human)
Description:
gi_5174617
Residue:
953
  
Inhibitor
Name:
BDBM67402
Synonyms:
5-(4-chlorophenyl)-2-(2,3,4,5,6-pentafluorophenyl)sulfonyl-3-pyrazolamine 5-(4-chlorophenyl)-2-[2,3,4,5,6-pentakis(fluoranyl)phenyl]sulfonyl-pyrazol-3-amine [5-(4-chlorophenyl)-2-(2,3,4,5,6-pentafluorophenyl)sulfonyl-pyrazol-3-yl]amine | cid_16654631
Type:
Small organic molecule
Emp. Form.:
C15H7ClF5N3O2S
Mol. Mass.:
423.745
SMILES:
Nc1cc(nn1S(=O)(=O)c1c(F)c(F)c(F)c(F)c1F)-c1ccc(Cl)cc1
: