Target
Nucleotide-binding oligomerization domain-containing protein 1
Ligand
BDBM59542
Substrate
Meas. Tech.
SAR analysis of compounds that inhibit NOD1 - Set 3
IC50
257±n/a nM
Citation
 PubChem, PC SAR analysis of compounds that inhibit NOD1 - Set 3 PubChem Bioassay (2010)[AID] 
Target
Name:
Nucleotide-binding oligomerization domain-containing protein 1
Synonyms:
CARD4 NOD1_HUMAN | nucleotide-binding oligomerization domain containing 1
Type:
Enzyme Catalytic Domain
Mol. Mass.:
107699.03
Organism:
Homo sapiens (Human)
Description:
gi_5174617
Residue:
953
  
Inhibitor
Name:
BDBM59542
Synonyms:
(1-tosylbenzimidazol-2-yl)amine 1-(4-methylphenyl)sulfonylbenzimidazol-2-amine MLS001201458 cid_1088438
Type:
Small organic molecule
Emp. Form.:
C14H13N3O2S
Mol. Mass.:
287.337
SMILES:
Cc1ccc(cc1)S(=O)(=O)n1c(N)nc2ccccc12
: