Target
Nucleotide-binding oligomerization domain-containing protein 1
Ligand
BDBM49106
Substrate
Meas. Tech.
SAR analysis of compounds that inhibit NOD1 - Set 3
IC50
1360±n/a nM
Citation
 PubChem, PC SAR analysis of compounds that inhibit NOD1 - Set 3 PubChem Bioassay (2010)[AID] 
Target
Name:
Nucleotide-binding oligomerization domain-containing protein 1
Synonyms:
CARD4 NOD1_HUMAN | nucleotide-binding oligomerization domain containing 1
Type:
Enzyme Catalytic Domain
Mol. Mass.:
107699.03
Organism:
Homo sapiens (Human)
Description:
gi_5174617
Residue:
953
  
Inhibitor
Name:
BDBM49106
Synonyms:
7-[(E)-but-2-enyl]-3-methyl-8-(3-phenylpropylsulfanyl)purine-2,6-dione 7-[(E)-but-2-enyl]-3-methyl-8-(3-phenylpropylthio)xanthine SMR000015484 | cid_5310346
Type:
Small organic molecule
Emp. Form.:
C19H22N4O2S
Mol. Mass.:
370.469
SMILES:
C\C=C\Cn1c(SCCCc2ccccc2)nc2n(C)c(=O)[nH]c(=O)c12
: