Target
Nucleotide-binding oligomerization domain-containing protein 1
Ligand
BDBM65734
Substrate
Meas. Tech.
SAR analysis of compounds that inhibit NOD1 - Set 3
IC50
>20000±n/a nM
Citation
 PubChem, PC SAR analysis of compounds that inhibit NOD1 - Set 3 PubChem Bioassay (2010)[AID] 
Target
Name:
Nucleotide-binding oligomerization domain-containing protein 1
Synonyms:
CARD4 NOD1_HUMAN | nucleotide-binding oligomerization domain containing 1
Type:
Enzyme Catalytic Domain
Mol. Mass.:
107699.03
Organism:
Homo sapiens (Human)
Description:
gi_5174617
Residue:
953
  
Inhibitor
Name:
BDBM65734
Synonyms:
3-methyl-8-(3-phenylpropylsulfanyl)-7-prop-2-enyl-purine-2,6-dione 3-methyl-8-(3-phenylpropylthio)-7-prop-2-enylpurine-2,6-dione MLS-0061481.0001 | cid_2989653
Type:
Small organic molecule
Emp. Form.:
C18H20N4O2S
Mol. Mass.:
356.442
SMILES:
Cn1c2nc(SCCCc3ccccc3)n(CC=C)c2c(=O)[nH]c1=O
: