Target
Nucleotide-binding oligomerization domain-containing protein 2
Ligand
BDBM67403
Substrate
Meas. Tech.
SAR analysis of compounds that inhibit NOD2 - Set 3
IC50
11900±n/a nM
Citation
 PubChem, PC SAR analysis of compounds that inhibit NOD2 - Set 3 PubChem Bioassay (2010)[AID] 
Target
Name:
Nucleotide-binding oligomerization domain-containing protein 2
Synonyms:
CARD15 IBD1 NOD2 Nucleotide-binding oligomerization domain-containing protein 2 | nucleotide-binding oligomerization domain containing 2
Type:
PROTEIN
Mol. Mass.:
115287.18
Organism:
Homo sapiens (Human)
Description:
ChEMBL_1454053
Residue:
1040
  
Inhibitor
Name:
BDBM67403
Synonyms:
7-butyl-3-methyl-8-(3-phenylpropylsulfanyl)purine-2,6-dione 7-butyl-3-methyl-8-(3-phenylpropylthio)xanthine cid_3123424
Type:
Small organic molecule
Emp. Form.:
C19H24N4O2S
Mol. Mass.:
372.484
SMILES:
CCCCn1c(SCCCc2ccccc2)nc2n(C)c(=O)[nH]c(=O)c12
: