Target
Nucleotide-binding oligomerization domain-containing protein 2
Ligand
BDBM56887
Substrate
Meas. Tech.
SAR analysis of compounds that inhibit NOD2 - Set 3
IC50
>20000±n/a nM
Citation
 PubChem, PC SAR analysis of compounds that inhibit NOD2 - Set 3 PubChem Bioassay (2010)[AID] 
Target
Name:
Nucleotide-binding oligomerization domain-containing protein 2
Synonyms:
CARD15 IBD1 NOD2 Nucleotide-binding oligomerization domain-containing protein 2 | nucleotide-binding oligomerization domain containing 2
Type:
PROTEIN
Mol. Mass.:
115287.18
Organism:
Homo sapiens (Human)
Description:
ChEMBL_1454053
Residue:
1040
  
Inhibitor
Name:
BDBM56887
Synonyms:
7-Butyl-3-methyl-8-(2-oxo-2-phenyl-ethylsulfanyl)-3,7-dihydro-purine-2,6-dione 7-butyl-3-methyl-8-(phenacylthio)xanthine 7-butyl-3-methyl-8-phenacylsulfanylpurine-2,6-dione SMR000009754 | cid_646940
Type:
Small organic molecule
Emp. Form.:
C18H20N4O3S
Mol. Mass.:
372.441
SMILES:
CCCCn1c(SCC(=O)c2ccccc2)nc2n(C)c(=O)[nH]c(=O)c12
: