Target
Nucleotide-binding oligomerization domain-containing protein 2
Ligand
BDBM67405
Substrate
Meas. Tech.
SAR analysis of compounds that inhibit NOD2 - Set 3
IC50
>20000±n/a nM
Citation
 PubChem, PC SAR analysis of compounds that inhibit NOD2 - Set 3 PubChem Bioassay (2010)[AID] 
Target
Name:
Nucleotide-binding oligomerization domain-containing protein 2
Synonyms:
CARD15 IBD1 NOD2 Nucleotide-binding oligomerization domain-containing protein 2 | nucleotide-binding oligomerization domain containing 2
Type:
PROTEIN
Mol. Mass.:
115287.18
Organism:
Homo sapiens (Human)
Description:
ChEMBL_1454053
Residue:
1040
  
Inhibitor
Name:
BDBM67405
Synonyms:
(1-p-cumenylsulfonylbenzimidazol-2-yl)amine 1-(4-propan-2-ylphenyl)sulfonylbenzimidazol-2-amine cid_45253889
Type:
Small organic molecule
Emp. Form.:
C16H17N3O2S
Mol. Mass.:
315.39
SMILES:
CC(C)c1ccc(cc1)S(=O)(=O)n1c(N)nc2ccccc12
: