Target
Tumor necrosis factor
Ligand
BDBM67410
Substrate
Meas. Tech.
SAR analysis of inhibitors of TNFa specific NF-kB induction - Set 3
IC50
>20000±n/a nM
Citation
 PubChem, PC SAR analysis of inhibitors of TNFa specific NF-kB induction - Set 3 PubChem Bioassay (2010)[AID] 
Target
Name:
Tumor necrosis factor
Synonyms:
Cachectin TNF-a TNFA TNFSF2 Tumor necrosis factor (TNFa) Tumor necrosis factor ligand superfamily member 2 Tumor necrosis factor, soluble form | tumor necrosis factor alpha
Type:
Enzyme
Mol. Mass.:
25645.11
Organism:
Homo sapiens (Human)
Description:
P01375
Residue:
233
  
Inhibitor
Name:
BDBM67410
Synonyms:
1-(3,4-dichlorophenyl)sulfonyl-2-benzimidazolamine MLS-0435754.0001 cid_45253883
Type:
Small organic molecule
Emp. Form.:
C13H9Cl2N3O2S
Mol. Mass.:
342.2
SMILES:
Nc1nc2ccccc2n1S(=O)(=O)c1ccc(Cl)c(Cl)c1
: