Target
Tumor necrosis factor
Ligand
BDBM67414
Substrate
Meas. Tech.
SAR analysis of inhibitors of TNFa specific NF-kB induction - Set 3
IC50
>20000±n/a nM
Citation
 PubChem, PC SAR analysis of inhibitors of TNFa specific NF-kB induction - Set 3 PubChem Bioassay (2010)[AID] 
Target
Name:
Tumor necrosis factor
Synonyms:
Cachectin TNF-a TNFA TNFSF2 Tumor necrosis factor (TNFa) Tumor necrosis factor ligand superfamily member 2 Tumor necrosis factor, soluble form | tumor necrosis factor alpha
Type:
Enzyme
Mol. Mass.:
25645.11
Organism:
Homo sapiens (Human)
Description:
P01375
Residue:
233
  
Inhibitor
Name:
BDBM67414
Synonyms:
MLS-0435775.0001 N-[1H-indol-3-yl(phenyl)methyl]-N-methylbenzamide | cid_13013141
Type:
Small organic molecule
Emp. Form.:
C23H20N2O
Mol. Mass.:
340.4177
SMILES:
CN(C(c1c[nH]c2ccccc12)c1ccccc1)C(=O)c1ccccc1
: