Target
Female germline-specific tumor suppressor gld-1
Ligand
BDBM52200
Substrate
Meas. Tech.
Fluorescence polarization-based biochemical high throughput dose response assay for inhibitors of GLD-1 protein - TGE RNA interaction
IC50
7718±n/a nM
Citation
 PubChem, PC Fluorescence polarization-based biochemical high throughput dose response assay for inhibitors of GLD-1 protein - TGE RNA interaction PubChem Bioassay (2010)[AID] 
Target
Name:
Female germline-specific tumor suppressor gld-1
Synonyms:
GLD1_CAEEL gld-1
Type:
Enzyme Catalytic Domain
Mol. Mass.:
50591.33
Organism:
Caenorhabditis elegans
Description:
gi_17507875
Residue:
463
  
Inhibitor
Name:
BDBM52200
Synonyms:
2-(5-chloro-1,3-dioxo-3a,4,7,7a-tetrahydroisoindol-2-yl)-N-(phenylmethyl)acetamide MLS000109240 N-benzyl-2-(5-chloro-1,3-dioxo-3a,4,7,7a-tetrahydroisoindol-2-yl)acetamide cid_2870963
Type:
Small organic molecule
Emp. Form.:
C17H17ClN2O3
Mol. Mass.:
332.781
SMILES:
ClC1=CCC2C(C1)C(=O)N(CC(=O)NCc1ccccc1)C2=O
: