Target
Female germline-specific tumor suppressor gld-1
Ligand
BDBM50926
Substrate
Meas. Tech.
Fluorescence polarization-based biochemical high throughput dose response assay for inhibitors of GLD-1 protein - TGE RNA interaction
IC50
>2209±n/a nM
Citation
 PubChem, PC Fluorescence polarization-based biochemical high throughput dose response assay for inhibitors of GLD-1 protein - TGE RNA interaction PubChem Bioassay (2010)[AID] 
Target
Name:
Female germline-specific tumor suppressor gld-1
Synonyms:
GLD1_CAEEL gld-1
Type:
Enzyme Catalytic Domain
Mol. Mass.:
50591.33
Organism:
Caenorhabditis elegans
Description:
gi_17507875
Residue:
463
  
Inhibitor
Name:
BDBM50926
Synonyms:
4,8-dimethylcyclopenta[c]quinolizine-1,2-dicarboxylic acid dimethyl ester SMR000161422 dimethyl 4,8-dimethylcyclopenta[c]quinolizine-1,2-dicarboxylate
Type:
Small organic molecule
Emp. Form.:
C18H17NO4
Mol. Mass.:
311.3319
SMILES:
COC(=O)c1cc2c(C)cc3ccc(C)cn3c2c1C(=O)OC
: