Target
Female germline-specific tumor suppressor gld-1
Ligand
BDBM52393
Substrate
Meas. Tech.
Fluorescence polarization-based biochemical high throughput dose response assay for inhibitors of GLD-1 protein - TGE RNA interaction
IC50
>59605±n/a nM
Citation
 PubChem, PC Fluorescence polarization-based biochemical high throughput dose response assay for inhibitors of GLD-1 protein - TGE RNA interaction PubChem Bioassay (2010)[AID] 
Target
Name:
Female germline-specific tumor suppressor gld-1
Synonyms:
GLD1_CAEEL gld-1
Type:
Enzyme Catalytic Domain
Mol. Mass.:
50591.33
Organism:
Caenorhabditis elegans
Description:
gi_17507875
Residue:
463
  
Inhibitor
Name:
BDBM52393
Synonyms:
(2Z)-2-(nitromethylene)-3-phenyl-thiazolidin-4-one (2Z)-2-(nitromethylidene)-3-phenyl-4-thiazolidinone MLS000543081 cid_5524004
Type:
Small organic molecule
Emp. Form.:
C10H8N2O3S
Mol. Mass.:
236.247
SMILES:
[O-][N+](=O)\C=C1/SCC(=O)N1c1ccccc1
: