Target
Female germline-specific tumor suppressor gld-1
Ligand
BDBM67449
Substrate
Meas. Tech.
Fluorescence polarization-based biochemical high throughput dose response assay for inhibitors of GLD-1 protein - TGE RNA interaction
IC50
4074±n/a nM
Citation
 PubChem, PC Fluorescence polarization-based biochemical high throughput dose response assay for inhibitors of GLD-1 protein - TGE RNA interaction PubChem Bioassay (2010)[AID] 
Target
Name:
Female germline-specific tumor suppressor gld-1
Synonyms:
GLD1_CAEEL gld-1
Type:
Enzyme Catalytic Domain
Mol. Mass.:
50591.33
Organism:
Caenorhabditis elegans
Description:
gi_17507875
Residue:
463
  
Inhibitor
Name:
BDBM67449
Synonyms:
2-(2,4-diketo-1,3-diazaspiro[4.5]decan-3-yl)acetic acid [2-keto-4-(trifluoromethyl)chromen-7-yl] ester MLS001141678 [2-oxidanylidene-4-(trifluoromethyl)chromen-7-yl] 2-[2,4-bis(oxidanylidene)-1,3-diazaspiro[4.5]decan-3-yl]ethanoate cid_16281348
Type:
Small organic molecule
Emp. Form.:
C20H17F3N2O6
Mol. Mass.:
438.354
SMILES:
FC(F)(F)c1cc(=O)oc2cc(OC(=O)CN3C(=O)NC4(CCCCC4)C3=O)ccc12
: