Target
NADPH oxidase 1
Ligand
BDBM67462
Substrate
Meas. Tech.
Late-stage luminescence-based cell-based dose response assay to identify inhibitors of NADPH oxidase 1 (NOX1): Purchased analogs
IC50
>17000±n/a nM
Citation
 PubChem, PC Late-stage luminescence-based cell-based dose response assay to identify inhibitors of NADPH oxidase 1 (NOX1): Purchased analogs PubChem Bioassay (2010)[AID] 
Target
Name:
NADPH oxidase 1
Synonyms:
MOX-1 Mitogenic oxidase 1 NOH-1 NOX-1 NOX1_HUMAN
Type:
PROTEIN
Mol. Mass.:
64890.44
Organism:
Homo sapiens (Human)
Description:
ChEMBL_792877
Residue:
564
  
Inhibitor
Name:
BDBM67462
Synonyms:
2-(3-methoxyphenyl)-4,5-diphenyl-1H-imidazole cid_3494148
Type:
Small organic molecule
Emp. Form.:
C22H18N2O
Mol. Mass.:
326.3911
SMILES:
COc1cccc(c1)-c1nc(c([nH]1)-c1ccccc1)-c1ccccc1
: