Target
NADPH oxidase 1
Ligand
BDBM67468
Substrate
Meas. Tech.
Late-stage luminescence-based cell-based dose response assay to identify inhibitors of NADPH oxidase 1 (NOX1): Purchased analogs
IC50
>17000±n/a nM
Citation
 PubChem, PC Late-stage luminescence-based cell-based dose response assay to identify inhibitors of NADPH oxidase 1 (NOX1): Purchased analogs PubChem Bioassay (2010)[AID] 
Target
Name:
NADPH oxidase 1
Synonyms:
MOX-1 Mitogenic oxidase 1 NOH-1 NOX-1 NOX1_HUMAN
Type:
PROTEIN
Mol. Mass.:
64890.44
Organism:
Homo sapiens (Human)
Description:
ChEMBL_792877
Residue:
564
  
Inhibitor
Name:
BDBM67468
Synonyms:
3-chloro-1-benzothiophene-2-carboxylic acid [3-(1-tetrazolyl)phenyl] ester SR-01000601764-2 [3-(tetrazol-1-yl)phenyl] 3-chloro-1-benzothiophene-2-carboxylate | cid_650207
Type:
Small organic molecule
Emp. Form.:
C16H9ClN4O2S
Mol. Mass.:
356.786
SMILES:
Clc1c(sc2ccccc12)C(=O)Oc1cccc(c1)-n1cnnn1
: