Target
NADPH oxidase 1
Ligand
BDBM67487
Substrate
Meas. Tech.
Late-stage luminescence-based cell-based dose response assay to identify inhibitors of NADPH oxidase 1 (NOX1): Purchased analogs
IC50
9010±n/a nM
Citation
 PubChem, PC Late-stage luminescence-based cell-based dose response assay to identify inhibitors of NADPH oxidase 1 (NOX1): Purchased analogs PubChem Bioassay (2010)[AID] 
Target
Name:
NADPH oxidase 1
Synonyms:
MOX-1 Mitogenic oxidase 1 NOH-1 NOX-1 NOX1_HUMAN
Type:
PROTEIN
Mol. Mass.:
64890.44
Organism:
Homo sapiens (Human)
Description:
ChEMBL_792877
Residue:
564
  
Inhibitor
Name:
BDBM67487
Synonyms:
4-[4,5-bis(4-methoxyphenyl)-1,3-dihydroimidazol-2-ylidene]-1-cyclohexa-2,5-dienone 4-[4,5-bis(4-methoxyphenyl)-4-imidazolin-2-ylidene]cyclohexa-2,5-dien-1-one cid_5339436
Type:
Small organic molecule
Emp. Form.:
C23H20N2O3
Mol. Mass.:
372.4165
SMILES:
COc1ccc(cc1)-c1nc([nH]c1-c1ccc(OC)cc1)-c1ccc(O)cc1
: