Target
NADPH oxidase 1
Ligand
BDBM67503
Substrate
Meas. Tech.
Late-stage luminescence-based cell-based dose response assay to identify inhibitors of NADPH oxidase 1 (NOX1): Purchased analogs
IC50
>17000±n/a nM
Citation
 PubChem, PC Late-stage luminescence-based cell-based dose response assay to identify inhibitors of NADPH oxidase 1 (NOX1): Purchased analogs PubChem Bioassay (2010)[AID] 
Target
Name:
NADPH oxidase 1
Synonyms:
MOX-1 Mitogenic oxidase 1 NOH-1 NOX-1 NOX1_HUMAN
Type:
PROTEIN
Mol. Mass.:
64890.44
Organism:
Homo sapiens (Human)
Description:
ChEMBL_792877
Residue:
564
  
Inhibitor
Name:
BDBM67503
Synonyms:
(4-nitrophenyl) 3-chloranyl-1-benzothiophene-2-carboxylate 3-chloro-1-benzothiophene-2-carboxylic acid (4-nitrophenyl) ester SR-03000000724-1 | cid_833130
Type:
Small organic molecule
Emp. Form.:
C15H8ClNO4S
Mol. Mass.:
333.746
SMILES:
[O-][N+](=O)c1ccc(OC(=O)c2sc3ccccc3c2Cl)cc1
: