Target
NADPH oxidase 1
Ligand
BDBM67535
Substrate
Meas. Tech.
Late-stage luminescence-based cell-based dose response assay to identify inhibitors of NADPH oxidase 1 (NOX1): Purchased analogs
IC50
>17000±n/a nM
Citation
 PubChem, PC Late-stage luminescence-based cell-based dose response assay to identify inhibitors of NADPH oxidase 1 (NOX1): Purchased analogs PubChem Bioassay (2010)[AID] 
Target
Name:
NADPH oxidase 1
Synonyms:
MOX-1 Mitogenic oxidase 1 NOH-1 NOX-1 NOX1_HUMAN
Type:
PROTEIN
Mol. Mass.:
64890.44
Organism:
Homo sapiens (Human)
Description:
ChEMBL_792877
Residue:
564
  
Inhibitor
Name:
BDBM67535
Synonyms:
(3-fluorophenyl) 3-chloranyl-1-benzothiophene-2-carboxylate 3-chloro-1-benzothiophene-2-carboxylic acid (3-fluorophenyl) ester SR-03000000758-1 | cid_22585688
Type:
Small organic molecule
Emp. Form.:
C15H8ClFO2S
Mol. Mass.:
306.739
SMILES:
Fc1cccc(OC(=O)c2sc3ccccc3c2Cl)c1
: