Target
NADPH oxidase 1
Ligand
BDBM67544
Substrate
Meas. Tech.
Late-stage luminescence-based cell-based dose response assay to identify inhibitors of NADPH oxidase 1 (NOX1): Purchased analogs
IC50
>17000±n/a nM
Citation
 PubChem, PC Late-stage luminescence-based cell-based dose response assay to identify inhibitors of NADPH oxidase 1 (NOX1): Purchased analogs PubChem Bioassay (2010)[AID] 
Target
Name:
NADPH oxidase 1
Synonyms:
MOX-1 Mitogenic oxidase 1 NOH-1 NOX-1 NOX1_HUMAN
Type:
PROTEIN
Mol. Mass.:
64890.44
Organism:
Homo sapiens (Human)
Description:
ChEMBL_792877
Residue:
564
  
Inhibitor
Name:
BDBM67544
Synonyms:
N,N-dimethyl-3-[2-(trifluoromethyl)-10-phenothiazinyl]-1-propanamine;hydrochloride SR-01000000224-4 cid_66069 med.21724, Compound Triflupromazine
Type:
Small organic molecule
Emp. Form.:
C18H19F3N2S
Mol. Mass.:
352.417
SMILES:
CN(C)CCCN1c2ccccc2Sc2ccc(cc12)C(F)(F)F
: