Target
Serine/threonine-protein kinase 33
Ligand
BDBM4293
Substrate
Meas. Tech.
Luminescence Cell-Free Homogenous Dose Retest to Identify Inhibitors of Serine/Threonine Kinase 33 Activity
EC50
44890±n/a nM
Citation
 PubChem, PC Luminescence Cell-Free Homogenous Dose Retest to Identify Inhibitors of Serine/Threonine Kinase 33 Activity PubChem Bioassay (2010)[AID] 
Target
Name:
Serine/threonine-protein kinase 33
Synonyms:
STK33 Serine/threonine-protein kinase 33
Type:
Enzyme Catalytic Domain
Mol. Mass.:
57833.21
Organism:
Homo sapiens (Human)
Description:
gi_23943882
Residue:
514
  
Inhibitor
Name:
BDBM4293
Synonyms:
(2E)-3-(3,4-dihydroxyphenyl)-2-[(3,4-dihydroxyphenyl)carbonyl]prop-2-enenitrile Tyrphostin deriv. 24 | cid_5328760
Type:
Small organic molecule
Emp. Form.:
C16H11NO5
Mol. Mass.:
297.2622
SMILES:
Oc1ccc(\C=C(/C#N)C(=O)c2ccc(O)c(O)c2)cc1O
: