Target
Guanine nucleotide-binding protein G(o) subunit alpha
Ligand
BDBM67701
Substrate
Meas. Tech.
Dose response, multiplexed high-throughput screen for small molecule regulators of RGS family protein interactions, specifically RGS7-Galphao with additional round of SAR compounds.
EC50
>30000±0 nM
Citation
 PubChem, PC Dose response, multiplexed high-throughput screen for small molecule regulators of RGS family protein interactions, specifically RGS7-Galphao with additional round of SAR compounds. PubChem Bioassay (2010)[AID] 
Target
Name:
Guanine nucleotide-binding protein G(o) subunit alpha
Synonyms:
GNAO1 Guanine nucleotide-binding protein G(o), alpha subunit 1 | guanine nucleotide-binding protein G(o) subunit alpha isoform a
Type:
PROTEIN
Mol. Mass.:
40043.59
Organism:
Homo sapiens (Human)
Description:
ChEMBL_321106
Residue:
354
  
Inhibitor
Name:
BDBM67701
Synonyms:
3-chloranyl-6-methyl-N-(3-morpholin-4-ylpropyl)-1-benzothiophene-2-carboxamide 3-chloro-6-methyl-N-(3-morpholinopropyl)benzothiophene-2-carboxamide KSC-1-101c cid_3579902
Type:
Small organic molecule
Emp. Form.:
C17H21ClN2O2S
Mol. Mass.:
352.879
SMILES:
Cc1ccc2c(Cl)c(sc2c1)C(=O)NCCCN1CCOCC1
: