Target
DNA damage-inducible transcript 3 protein
Ligand
BDBM66502
Substrate
Meas. Tech.
Dose-response primary assay and counterscreen assay for HTS small molecule inhibitors of CHOP to regulate the unfolded protein response to ER stress
IC50
<160±n/a nM
Citation
 PubChem, PC Dose-response primary assay and counterscreen assay for HTS small molecule inhibitors of CHOP to regulate the unfolded protein response to ER stress PubChem Bioassay (2010)[AID] 
Target
Name:
DNA damage-inducible transcript 3 protein
Synonyms:
Chop DDIT3_MOUSE Gadd153
Type:
Enzyme Catalytic Domain
Mol. Mass.:
19175.17
Organism:
Mus musculus
Description:
gi_160707929
Residue:
168
  
Inhibitor
Name:
BDBM66502
Synonyms:
(2Z,6E)-4-tert-butyl-2,6-bis(2-pyridinylmethylidene)-1-cyclohexanone (2Z,6E)-4-tert-butyl-2,6-bis(pyridin-2-ylmethylene)cyclohexanone MLS000729946 cid_2059132
Type:
Small organic molecule
Emp. Form.:
C22H24N2O
Mol. Mass.:
332.4388
SMILES:
CC(C)(C)C1C\C(=C\c2ccccn2)C(=O)\C(C1)=C\c1ccccn1
: