Target
Tyrosine-protein kinase ABL1 [1-999,Q252H]
Ligand
BDBM68214
Substrate
Meas. Tech.
Biochemcial Assay
pH
7.5±0
IC50
154±0.0 nM
Citation
 Okram, BNagle, AAdrián, FJLee, CRen, PWang, XSim, TXie, YWang, XXia, GSpraggon, GWarmuth, MLiu, YGray, NS A general strategy for creating "inactive-conformation" abl inhibitors. Chem Biol 13:779-86 (2006)  
Target
Name:
Tyrosine-protein kinase ABL1 [1-999,Q252H]
Synonyms:
ABL ABL1(Q252H) JTK7 Tyrosine-protein kinase ABL (dephosphorylated)
Type:
Enzyme Catalytic Domain
Mol. Mass.:
108590.01
Organism:
Homo sapiens (Human)
Description:
gi_62362414
Residue:
999
  
Inhibitor
Name:
BDBM68214
Synonyms:
Type II inhibitor, 8
Type:
Small organic molecule
Emp. Form.:
C25H17F3N4O2S
Mol. Mass.:
494.488
SMILES:
Cc1cc(NC(=O)c2cccc(c2)C(F)(F)F)ccc1NC(=O)c1cc2cnc3[nH]ccc3c2s1
: