Target
Cannabinoid receptor 2
Ligand
BDBM61068
Substrate
Meas. Tech.
SAR analysis of antagonists of the Cannabinoid Receptor 2 using an Image-Based Assay - Set 2
IC50
>32000±n/a nM
Citation
 PubChem, PC SAR analysis of antagonists of the Cannabinoid Receptor 2 using an Image-Based Assay - Set 2 PubChem Bioassay (2010)[AID] 
Target
Name:
Cannabinoid receptor 2
Synonyms:
CANNABINOID CB2 CB2 CB2B CNR2_HUMAN Cannabinoid CB2 receptor Cannabinoid receptor 2 (CB2R) | hCB2
Type:
G Protein-Coupled Receptor (GPCR)
Mol. Mass.:
39690.94
Organism:
Homo sapiens (Human)
Description:
P34972
Residue:
360
  
Inhibitor
Name:
BDBM61068
Synonyms:
2-(4-acetamidophenyl)sulfanyl-N-(2-methoxydibenzofuran-3-yl)propanamide 2-[(4-acetamidophenyl)thio]-N-(2-methoxydibenzofuran-3-yl)propionamide SMR000248701 | cid_3400247
Type:
Small organic molecule
Emp. Form.:
C24H22N2O4S
Mol. Mass.:
434.507
SMILES:
COc1cc2c(cc1NC(=O)C(C)Sc1ccc(NC(C)=O)cc1)oc1ccccc21
: