Target
Cannabinoid receptor 2
Ligand
BDBM61132
Substrate
Meas. Tech.
SAR analysis of antagonists of the Cannabinoid Receptor 2 using an Image-Based Assay - Set 2
IC50
>32000±n/a nM
Citation
 PubChem, PC SAR analysis of antagonists of the Cannabinoid Receptor 2 using an Image-Based Assay - Set 2 PubChem Bioassay (2010)[AID] 
Target
Name:
Cannabinoid receptor 2
Synonyms:
CANNABINOID CB2 CB2 CB2B CNR2_HUMAN Cannabinoid CB2 receptor Cannabinoid receptor 2 (CB2R) | hCB2
Type:
G Protein-Coupled Receptor (GPCR)
Mol. Mass.:
39690.94
Organism:
Homo sapiens (Human)
Description:
P34972
Residue:
360
  
Inhibitor
Name:
BDBM61132
Synonyms:
1-(4-amino-1,2,5-oxadiazol-3-yl)-N-[[(Z)-2-methyl-3-phenylprop-2-enylidene]amino]-5-[(4-methyl-1-piperidinyl)methyl]-4-triazolecarboxamide 1-(4-aminofurazan-3-yl)-N-[[(Z)-2-methyl-3-phenyl-prop-2-enylidene]amino]-5-[(4-methylpiperidino)methyl]triazole-4-carboxamide MLS000923861 cid_24789557
Type:
Small organic molecule
Emp. Form.:
C22H27N9O2
Mol. Mass.:
449.5089
SMILES:
CC1CCN(Cc2c(nnn2-c2nonc2N)C(=O)NN=C\C(C)=C/c2ccccc2)CC1
: