Target
Cannabinoid receptor 2
Ligand
BDBM68310
Substrate
Meas. Tech.
SAR analysis of antagonists of the Cannabinoid Receptor 2 using an Image-Based Assay - Set 2
IC50
>32000±n/a nM
Citation
 PubChem, PC SAR analysis of antagonists of the Cannabinoid Receptor 2 using an Image-Based Assay - Set 2 PubChem Bioassay (2010)[AID] 
Target
Name:
Cannabinoid receptor 2
Synonyms:
CANNABINOID CB2 CB2 CB2B CNR2_HUMAN Cannabinoid CB2 receptor Cannabinoid receptor 2 (CB2R) | hCB2
Type:
G Protein-Coupled Receptor (GPCR)
Mol. Mass.:
39690.94
Organism:
Homo sapiens (Human)
Description:
P34972
Residue:
360
  
Inhibitor
Name:
BDBM68310
Synonyms:
MLS-0435536.0001 N-(5-morpholin-4-ylsulfonyl-2-propan-2-yloxy-phenyl)-1-benzothiophene-2-carboxamide N-[5-(4-morpholinylsulfonyl)-2-propan-2-yloxyphenyl]-1-benzothiophene-2-carboxamide | cid_16282645
Type:
Small organic molecule
Emp. Form.:
C22H24N2O5S2
Mol. Mass.:
460.566
SMILES:
CC(C)Oc1ccc(cc1NC(=O)c1cc2ccccc2s1)S(=O)(=O)N1CCOCC1
: