Target
Cannabinoid receptor 2
Ligand
BDBM68311
Substrate
Meas. Tech.
SAR analysis of antagonists of the Cannabinoid Receptor 2 using an Image-Based Assay - Set 2
IC50
>32000±n/a nM
Citation
 PubChem, PC SAR analysis of antagonists of the Cannabinoid Receptor 2 using an Image-Based Assay - Set 2 PubChem Bioassay (2010)[AID] 
Target
Name:
Cannabinoid receptor 2
Synonyms:
CANNABINOID CB2 CB2 CB2B CNR2_HUMAN Cannabinoid CB2 receptor Cannabinoid receptor 2 (CB2R) | hCB2
Type:
G Protein-Coupled Receptor (GPCR)
Mol. Mass.:
39690.94
Organism:
Homo sapiens (Human)
Description:
P34972
Residue:
360
  
Inhibitor
Name:
BDBM68311
Synonyms:
MLS-0435537.0001 N-(2-methoxy-5-morpholin-4-ylsulfonylphenyl)-5,6,7,8-tetrahydro-4H-cyclohepta[b]thiophene-2-carboxamide N-[2-methoxy-5-(4-morpholinylsulfonyl)phenyl]-5,6,7,8-tetrahydro-4H-cyclohepta[b]thiophene-2-carboxamide | cid_16305071
Type:
Small organic molecule
Emp. Form.:
C21H26N2O5S2
Mol. Mass.:
450.572
SMILES:
COc1ccc(cc1NC(=O)c1cc2CCCCCc2s1)S(=O)(=O)N1CCOCC1
: