Target
Cannabinoid receptor 2
Ligand
BDBM68330
Substrate
Meas. Tech.
SAR analysis of antagonists of the Cannabinoid Receptor 2 using an Image-Based Assay - Set 2
IC50
>32000±n/a nM
Citation
 PubChem, PC SAR analysis of antagonists of the Cannabinoid Receptor 2 using an Image-Based Assay - Set 2 PubChem Bioassay (2010)[AID] 
Target
Name:
Cannabinoid receptor 2
Synonyms:
CANNABINOID CB2 CB2 CB2B CNR2_HUMAN Cannabinoid CB2 receptor Cannabinoid receptor 2 (CB2R) | hCB2
Type:
G Protein-Coupled Receptor (GPCR)
Mol. Mass.:
39690.94
Organism:
Homo sapiens (Human)
Description:
P34972
Residue:
360
  
Inhibitor
Name:
BDBM68330
Synonyms:
MLS-0435573.0001 N-(3-morpholinosulfonylphenyl)-4,5,6,7-tetrahydrobenzothiophene-2-carboxamide cid_2970280
Type:
Small organic molecule
Emp. Form.:
C19H22N2O4S2
Mol. Mass.:
406.519
SMILES:
O=C(Nc1cccc(c1)S(=O)(=O)N1CCOCC1)c1cc2CCCCc2s1
: