Target
G-protein coupled receptor 35
Ligand
BDBM68304
Substrate
Meas. Tech.
SAR analysis of Agonists of the GPR35 Receptor using an Image-Based Assay - Set 3
EC50
>32000±n/a nM
Citation
 PubChem, PC SAR analysis of Agonists of the GPR35 Receptor using an Image-Based Assay - Set 3 PubChem Bioassay (2010)[AID] 
Target
Name:
G-protein coupled receptor 35
Synonyms:
G protein-coupled receptor 35 GPR35_HUMAN
Type:
Enzyme Catalytic Domain
Mol. Mass.:
34085.57
Organism:
Homo sapiens (Human)
Description:
gi_33695097
Residue:
309
  
Inhibitor
Name:
BDBM68304
Synonyms:
MLS-0435530.0001 N,N-diethyl-4-(4-methylpiperidin-1-yl)-3-(4-phenylpiperazin-1-yl)carbonyl-benzenesulfonamide N,N-diethyl-4-(4-methylpiperidino)-3-(4-phenylpiperazine-1-carbonyl)benzenesulfonamide | cid_16233035
Type:
Small organic molecule
Emp. Form.:
C27H38N4O3S
Mol. Mass.:
498.681
SMILES:
CCN(CC)S(=O)(=O)c1ccc(N2CCC(C)CC2)c(c1)C(=O)N1CCN(CC1)c1ccccc1
: