Target
G-protein coupled receptor 35
Ligand
BDBM68327
Substrate
Meas. Tech.
SAR analysis of Agonists of the GPR35 Receptor using an Image-Based Assay - Set 3
EC50
>32000±n/a nM
Citation
 PubChem, PC SAR analysis of Agonists of the GPR35 Receptor using an Image-Based Assay - Set 3 PubChem Bioassay (2010)[AID] 
Target
Name:
G-protein coupled receptor 35
Synonyms:
G protein-coupled receptor 35 GPR35_HUMAN
Type:
Enzyme Catalytic Domain
Mol. Mass.:
34085.57
Organism:
Homo sapiens (Human)
Description:
gi_33695097
Residue:
309
  
Inhibitor
Name:
BDBM68327
Synonyms:
MLS-0435557.0001 | cid_3190055
Type:
Small organic molecule
Emp. Form.:
C24H19N5O4S2
Mol. Mass.:
505.569
SMILES:
COc1ccc(cc1)-c1csc(NC(=O)CSc2nnc3c(C)cc4cc5OCOc5cc4n23)n1
: