Target
G-protein coupled receptor 35
Ligand
BDBM68323
Substrate
Meas. Tech.
SAR analysis of Antagonists of the GPR35 Receptor using an Image-Based Assay - Set 4
IC50
>32000±n/a nM
Citation
 PubChem, PC SAR analysis of Antagonists of the GPR35 Receptor using an Image-Based Assay - Set 4 PubChem Bioassay (2010)[AID] 
Target
Name:
G-protein coupled receptor 35
Synonyms:
G protein-coupled receptor 35 GPR35_HUMAN
Type:
Enzyme Catalytic Domain
Mol. Mass.:
34085.57
Organism:
Homo sapiens (Human)
Description:
gi_33695097
Residue:
309
  
Inhibitor
Name:
BDBM68323
Synonyms:
2-[(4,8-dimethyl-[1,2,4]triazolo[4,3-a]quinolin-1-yl)sulfanyl]-N-methyl-N-(4-phenyl-1,3-thiazol-2-yl)acetamide 2-[(4,8-dimethyl-[1,2,4]triazolo[4,3-a]quinolin-1-yl)thio]-N-methyl-N-(4-phenyl-2-thiazolyl)acetamide MLS-0435553.0001 | cid_1153409
Type:
Small organic molecule
Emp. Form.:
C24H21N5OS2
Mol. Mass.:
459.586
SMILES:
CN(C(=O)CSc1nnc2c(C)cc3ccc(C)cc3n12)c1nc(cs1)-c1ccccc1
: