Target
G-protein coupled receptor 35
Ligand
BDBM68326
Substrate
Meas. Tech.
SAR analysis of Antagonists of the GPR35 Receptor using an Image-Based Assay - Set 4
IC50
>32000±n/a nM
Citation
 PubChem, PC SAR analysis of Antagonists of the GPR35 Receptor using an Image-Based Assay - Set 4 PubChem Bioassay (2010)[AID] 
Target
Name:
G-protein coupled receptor 35
Synonyms:
G protein-coupled receptor 35 GPR35_HUMAN
Type:
Enzyme Catalytic Domain
Mol. Mass.:
34085.57
Organism:
Homo sapiens (Human)
Description:
gi_33695097
Residue:
309
  
Inhibitor
Name:
BDBM68326
Synonyms:
MLS-0435556.0001 | cid_1143390
Type:
Small organic molecule
Emp. Form.:
C23H17N5O3S2
Mol. Mass.:
475.543
SMILES:
Cc1cc2cc3OCOc3cc2n2c(SCC(=O)Nc3nc(cs3)-c3ccccc3)nnc12
: