Target
Cannabinoid receptor 2
Ligand
BDBM68322
Substrate
Meas. Tech.
SAR analysis of agonists of the Cannabinoid Receptor 2 using an Image-Based Assay - Set 2
EC50
>32000±n/a nM
Citation
 PubChem, PC SAR analysis of agonists of the Cannabinoid Receptor 2 using an Image-Based Assay - Set 2 PubChem Bioassay (2010)[AID] 
Target
Name:
Cannabinoid receptor 2
Synonyms:
CANNABINOID CB2 CB2 CB2B CNR2_HUMAN Cannabinoid CB2 receptor Cannabinoid receptor 2 (CB2R) | hCB2
Type:
G Protein-Coupled Receptor (GPCR)
Mol. Mass.:
39690.94
Organism:
Homo sapiens (Human)
Description:
P34972
Residue:
360
  
Inhibitor
Name:
BDBM68322
Synonyms:
4-(3,5-dimethyl-1-pyrazolyl)-N-[2-methoxy-5-(4-morpholinylsulfonyl)phenyl]benzamide 4-(3,5-dimethylpyrazol-1-yl)-N-(2-methoxy-5-morpholin-4-ylsulfonylphenyl)benzamide MLS-0311344.0001 | cid_3538139
Type:
Small organic molecule
Emp. Form.:
C23H26N4O5S
Mol. Mass.:
470.541
SMILES:
COc1ccc(cc1NC(=O)c1ccc(cc1)-n1nc(C)cc1C)S(=O)(=O)N1CCOCC1
: