Target
Cannabinoid receptor 2
Ligand
BDBM68328
Substrate
Meas. Tech.
SAR analysis of agonists of the Cannabinoid Receptor 2 using an Image-Based Assay - Set 2
EC50
>32000±n/a nM
Citation
 PubChem, PC SAR analysis of agonists of the Cannabinoid Receptor 2 using an Image-Based Assay - Set 2 PubChem Bioassay (2010)[AID] 
Target
Name:
Cannabinoid receptor 2
Synonyms:
CANNABINOID CB2 CB2 CB2B CNR2_HUMAN Cannabinoid CB2 receptor Cannabinoid receptor 2 (CB2R) | hCB2
Type:
G Protein-Coupled Receptor (GPCR)
Mol. Mass.:
39690.94
Organism:
Homo sapiens (Human)
Description:
P34972
Residue:
360
  
Inhibitor
Name:
BDBM68328
Synonyms:
2-[(7-methoxy-4-methyl-[1,2,4]triazolo[4,3-a]quinolin-1-yl)sulfanyl]-N-(4-methyl-1,3-thiazol-2-yl)acetamide 2-[(7-methoxy-4-methyl-[1,2,4]triazolo[4,3-a]quinolin-1-yl)thio]-N-(4-methyl-2-thiazolyl)acetamide MLS-0435560.0001 | cid_1135732
Type:
Small organic molecule
Emp. Form.:
C18H17N5O2S2
Mol. Mass.:
399.49
SMILES:
COc1ccc2c(cc(C)c3nnc(SCC(=O)Nc4nc(C)cs4)n23)c1
: