Target
Cannabinoid receptor 1
Ligand
BDBM68311
Substrate
Meas. Tech.
SAR analysis of antagonists of the Cannabinoid Receptor 1 using an Image-Based Assay - Set 3
IC50
20600±n/a nM
Citation
 PubChem, PC SAR analysis of antagonists of the Cannabinoid Receptor 1 using an Image-Based Assay - Set 3 PubChem Bioassay (2010)[AID] 
Target
Name:
Cannabinoid receptor 1
Synonyms:
CANN6 CB-R CNR CNR1_HUMAN Cannabinoid receptor Cannabinoid receptor 1 (brain)
Type:
G Protein-Coupled Receptor (GPCR)
Mol. Mass.:
52868.96
Organism:
Homo sapiens (Human)
Description:
P21554
Residue:
472
  
Inhibitor
Name:
BDBM68311
Synonyms:
MLS-0435537.0001 N-(2-methoxy-5-morpholin-4-ylsulfonylphenyl)-5,6,7,8-tetrahydro-4H-cyclohepta[b]thiophene-2-carboxamide N-[2-methoxy-5-(4-morpholinylsulfonyl)phenyl]-5,6,7,8-tetrahydro-4H-cyclohepta[b]thiophene-2-carboxamide | cid_16305071
Type:
Small organic molecule
Emp. Form.:
C21H26N2O5S2
Mol. Mass.:
450.572
SMILES:
COc1ccc(cc1NC(=O)c1cc2CCCCCc2s1)S(=O)(=O)N1CCOCC1
: