Target
Cannabinoid receptor 1
Ligand
BDBM68327
Substrate
Meas. Tech.
SAR analysis of antagonists of the Cannabinoid Receptor 1 using an Image-Based Assay - Set 3
IC50
>32000±n/a nM
Citation
 PubChem, PC SAR analysis of antagonists of the Cannabinoid Receptor 1 using an Image-Based Assay - Set 3 PubChem Bioassay (2010)[AID] 
Target
Name:
Cannabinoid receptor 1
Synonyms:
CANN6 CB-R CNR CNR1_HUMAN Cannabinoid receptor Cannabinoid receptor 1 (brain)
Type:
G Protein-Coupled Receptor (GPCR)
Mol. Mass.:
52868.96
Organism:
Homo sapiens (Human)
Description:
P21554
Residue:
472
  
Inhibitor
Name:
BDBM68327
Synonyms:
MLS-0435557.0001 | cid_3190055
Type:
Small organic molecule
Emp. Form.:
C24H19N5O4S2
Mol. Mass.:
505.569
SMILES:
COc1ccc(cc1)-c1csc(NC(=O)CSc2nnc3c(C)cc4cc5OCOc5cc4n23)n1
: