Target
Signal transducer and activator of transcription 1-alpha/beta
Ligand
BDBM68333
Substrate
Meas. Tech.
Late stage results from the probe development effort to identify activators of signal transducer and activator of transcription 1 (STAT1)
EC50
>229.17±n/a nM
Citation
 PubChem, PC Late stage results from the probe development effort to identify activators of signal transducer and activator of transcription 1 (STAT1): luminescence-based cell-based dose response assay for STAT1 activators PubChem Bioassay (2010)[AID] 
Target
Name:
Signal transducer and activator of transcription 1-alpha/beta
Synonyms:
STAT1 Signal transducer and activator of transcription 1-alpha/beta Transcription factor ISGF-3 components p91/p84 | signal transducer and activator of transcription 1 isoform alpha
Type:
Cytosolic Transcription Factor
Mol. Mass.:
87327.69
Organism:
Homo sapiens (Human)
Description:
Stat1 was expressed in sf9 cells from a baculovirus encoding the recombinant proteins. Stat1 dimer binds to DNA.
Residue:
750
  
Inhibitor
Name:
BDBM68333
Synonyms:
5-methyl-3-phenyl-7-(4-pyridyl)pyrazolo[1,5-a]pyrimidine 5-methyl-3-phenyl-7-pyridin-4-yl-pyrazolo[1,5-a]pyrimidine;2,2,2-tris(fluoranyl)ethanoic acid SR-03000000952-1 | cid_42640810
Type:
Small organic molecule
Emp. Form.:
C18H14N4
Mol. Mass.:
286.3306
SMILES:
Cc1cc(-c2ccncc2)n2ncc(-c3ccccc3)c2n1
: