Target
Signal transducer and activator of transcription 1-alpha/beta
Ligand
BDBM30718
Substrate
Meas. Tech.
Late stage results from the probe development effort to identify activators of signal transducer and activator of transcription 1 (STAT1)
EC50
10006±n/a nM
Citation
 PubChem, PC Late stage results from the probe development effort to identify activators of signal transducer and activator of transcription 1 (STAT1): luminescence-based cell-based dose response assay for STAT1 activators PubChem Bioassay (2010)[AID] 
Target
Name:
Signal transducer and activator of transcription 1-alpha/beta
Synonyms:
STAT1 Signal transducer and activator of transcription 1-alpha/beta Transcription factor ISGF-3 components p91/p84 | signal transducer and activator of transcription 1 isoform alpha
Type:
Cytosolic Transcription Factor
Mol. Mass.:
87327.69
Organism:
Homo sapiens (Human)
Description:
Stat1 was expressed in sf9 cells from a baculovirus encoding the recombinant proteins. Stat1 dimer binds to DNA.
Residue:
750
  
Inhibitor
Name:
BDBM30718
Synonyms:
7-(diethylamino)-2-keto-N-(2-pyridyl)chromene-3-carboxamide 7-(diethylamino)-2-oxo-N-(2-pyridinyl)-1-benzopyran-3-carboxamide JMC493759 Compound 3 SMR000039268 | cid_658314
Type:
Small organic molecule
Emp. Form.:
C19H19N3O3
Mol. Mass.:
337.3725
SMILES:
CCN(CC)c1ccc2cc(C(=O)Nc3ccccn3)c(=O)oc2c1
: