Target
ATP-dependent molecular chaperone HSP82
Ligand
BDBM34677
Substrate
Meas. Tech.
Luminescence Cell-Based Secondary Assay to Identify Inhibitors of Hsp90
EC50
7657±n/a nM
Citation
 PubChem, PC Luminescence Cell-Based Secondary Assay to Identify Inhibitors of Hsp90 PubChem Bioassay (2010)[AID] 
Target
Name:
ATP-dependent molecular chaperone HSP82
Synonyms:
heat shock protein 90
Type:
Enzyme Catalytic Domain
Mol. Mass.:
80784.12
Organism:
Candida albicans
Description:
gi_994798
Residue:
707
  
Inhibitor
Name:
BDBM34677
Synonyms:
3-(4-methylbenzoyl)benzo[g][1]benzofuran-4,5-dione 3-(4-methylphenyl)carbonylbenzo[g][1]benzofuran-4,5-dione 3-p-toluoylbenzo[g]benzofuran-4,5-quinone SMR000137097 | cid_1736341
Type:
Small organic molecule
Emp. Form.:
C20H12O4
Mol. Mass.:
316.3069
SMILES:
Cc1ccc(cc1)C(=O)c1coc-2c1C(=O)C(=O)c1ccccc-21
: