Target
ATP-dependent molecular chaperone HSP82
Ligand
BDBM68337
Substrate
Meas. Tech.
Luminescence Cell-Based Secondary Assay to Identify Inhibitors of Hsp90
EC50
58940±n/a nM
Citation
 PubChem, PC Luminescence Cell-Based Secondary Assay to Identify Inhibitors of Hsp90 PubChem Bioassay (2010)[AID] 
Target
Name:
ATP-dependent molecular chaperone HSP82
Synonyms:
heat shock protein 90
Type:
Enzyme Catalytic Domain
Mol. Mass.:
80784.12
Organism:
Candida albicans
Description:
gi_994798
Residue:
707
  
Inhibitor
Name:
BDBM68337
Synonyms:
BRD-K57196652-003-05-9 N-(3-carbamoyl-6-isopropyl-5,7-dihydro-4H-thieno[2,3-c]pyridin-2-yl)-1,3-benzothiazole-2-carboxamide cid_4625945
Type:
Small organic molecule
Emp. Form.:
C19H20N4O2S2
Mol. Mass.:
400.518
SMILES:
CC(C)N1CCc2c(C1)sc(NC(=O)c1nc3ccccc3s1)c2C(N)=O
: