Target
Serine/threonine-protein phosphatase
Ligand
BDBM68338
Substrate
Meas. Tech.
Fluorescence Cell-Based Secondary Assay to Identify Inhibitors of Calcineurin
EC50
>285000±n/a nM
Citation
 PubChem, PC Fluorescence Cell-Based Secondary Assay to Identify Inhibitors of Calcineurin PubChem Bioassay (2010)[AID] 
Target
Name:
Serine/threonine-protein phosphatase
Synonyms:
calcineurin A1, putative serine/threonine-protein phosphatase 2B catalytic subunit A1, putative
Type:
Enzyme Catalytic Domain
Mol. Mass.:
69558.03
Organism:
Candida dubliniensis CD36
Description:
gi_223640082
Residue:
607
  
Inhibitor
Name:
BDBM68338
Synonyms:
(2Z)-2-(phenylmethylene)-4,9-dihydro-3H-carbazol-1-one (2Z)-2-benzal-4,9-dihydro-3H-carbazol-1-one BRD-K70731066-001-03-5 | cid_11958790
Type:
Small organic molecule
Emp. Form.:
C19H15NO
Mol. Mass.:
273.3285
SMILES:
O=C1c2[nH]c3ccccc3c2CC\C1=C\c1ccccc1
: