Target
Serine/threonine-protein phosphatase
Ligand
BDBM64627
Substrate
Meas. Tech.
Fluorescence Cell-Based Secondary Assay to Identify Inhibitors of Calcineurin
EC50
9168±n/a nM
Citation
 PubChem, PC Fluorescence Cell-Based Secondary Assay to Identify Inhibitors of Calcineurin PubChem Bioassay (2010)[AID] 
Target
Name:
Serine/threonine-protein phosphatase
Synonyms:
calcineurin A1, putative serine/threonine-protein phosphatase 2B catalytic subunit A1, putative
Type:
Enzyme Catalytic Domain
Mol. Mass.:
69558.03
Organism:
Candida dubliniensis CD36
Description:
gi_223640082
Residue:
607
  
Inhibitor
Name:
BDBM64627
Synonyms:
2-N-(3,4-dimethylphenyl)-6-(4-methylpiperidin-1-yl)-5-nitropyrimidine-2,4-diamine N*2*-(3,4-Dimethyl-phenyl)-6-(4-methyl-piperidin-1-yl)-5-nitro-pyrimidine-2,4-diamine N2-(3,4-dimethylphenyl)-6-(4-methylpiperidin-1-yl)-5-nitro-pyrimidine-2,4-diamine [4-amino-6-(4-methylpiperidino)-5-nitro-pyrimidin-2-yl]-(3,4-dimethylphenyl)amine | cid_3830492
Type:
Small organic molecule
Emp. Form.:
C18H24N6O2
Mol. Mass.:
356.4222
SMILES:
CC1CCN(CC1)c1nc(Nc2ccc(C)c(C)c2)nc(N)c1[N+]([O-])=O
: