Target
Glycogen synthase kinase-3 beta
Ligand
BDBM53678
Substrate
Meas. Tech.
Luminescence Cell-Free Homogeneous Dose Retest to Identify Inhibitors of Glycogen Synthase Kinase-3 beta Activity
EC50
>300000±n/a nM
Citation
 PubChem, PC Luminescence Cell-Free Homogeneous Dose Retest to Identify Inhibitors of Glycogen Synthase Kinase-3 beta Activity PubChem Bioassay (2010)[AID] 
Target
Name:
Glycogen synthase kinase-3 beta
Synonyms:
GSK-3 beta GSK3B Glycogen synthase kinase 3 beta (GSK3B) Glycogen synthase kinase-3 beta (GSK-3B) Glycogen synthase kinase-3 beta (GSK3B) Glycogen synthase kinase-3beta (GSK3B) | Serine/threonine-protein kinase GSK3B
Type:
Enzyme
Mol. Mass.:
46756.38
Organism:
Homo sapiens (Human)
Description:
P49841
Residue:
420
  
Inhibitor
Name:
BDBM53678
Synonyms:
4-butyl-7-methyl-5-(2H-1,2,3,4-tetrazol-5-ylmethoxy)chromen-2-one 4-butyl-7-methyl-5-(2H-tetrazol-5-ylmethoxy)chromen-2-one MLS000041678 cid_665397
Type:
Small organic molecule
Emp. Form.:
C16H18N4O3
Mol. Mass.:
314.3391
SMILES:
CCCCc1cc(=O)oc2cc(C)cc(OCc3nnn[nH]3)c12
: