Target
Glycogen synthase kinase-3 beta
Ligand
BDBM68484
Substrate
Meas. Tech.
Luminescence Cell-Free Homogeneous Dose Retest to Identify Inhibitors of Glycogen Synthase Kinase-3 beta Activity
EC50
>300000±n/a nM
Citation
 PubChem, PC Luminescence Cell-Free Homogeneous Dose Retest to Identify Inhibitors of Glycogen Synthase Kinase-3 beta Activity PubChem Bioassay (2010)[AID] 
Target
Name:
Glycogen synthase kinase-3 beta
Synonyms:
GSK-3 beta GSK3B Glycogen synthase kinase 3 beta (GSK3B) Glycogen synthase kinase-3 beta (GSK-3B) Glycogen synthase kinase-3 beta (GSK3B) Glycogen synthase kinase-3beta (GSK3B) | Serine/threonine-protein kinase GSK3B
Type:
Enzyme
Mol. Mass.:
46756.38
Organism:
Homo sapiens (Human)
Description:
P49841
Residue:
420
  
Inhibitor
Name:
BDBM68484
Synonyms:
7-(2-fluorophenyl)-5-methyl-1,7-dihydro-[1,2,4]triazolo[1,5-a]pyrimidine-6-carboxylic acid ethyl ester SMR000032941 ethyl 7-(2-fluorophenyl)-5-methyl-1,7-dihydro-[1,2,4]triazolo[1,5-a]pyrimidine-6-carboxylate | ethyl 7-(2-fluorophenyl)-5-methyl-4,7-dihydro[1,2,4]triazolo[1,5-a]pyrimidine-6-carboxylate
Type:
Small organic molecule
Emp. Form.:
C15H15FN4O2
Mol. Mass.:
302.3036
SMILES:
CCOC(=O)C1C(c2ccccc2F)n2ncnc2N=C1C
: