Target
Glycogen synthase kinase-3 beta
Ligand
BDBM68598
Substrate
Meas. Tech.
Luminescence Cell-Free Homogeneous Dose Retest to Identify Inhibitors of Glycogen Synthase Kinase-3 beta Activity
EC50
>300000±n/a nM
Citation
 PubChem, PC Luminescence Cell-Free Homogeneous Dose Retest to Identify Inhibitors of Glycogen Synthase Kinase-3 beta Activity PubChem Bioassay (2010)[AID] 
Target
Name:
Glycogen synthase kinase-3 beta
Synonyms:
GSK-3 beta GSK3B Glycogen synthase kinase 3 beta (GSK3B) Glycogen synthase kinase-3 beta (GSK-3B) Glycogen synthase kinase-3 beta (GSK3B) Glycogen synthase kinase-3beta (GSK3B) | Serine/threonine-protein kinase GSK3B
Type:
Enzyme
Mol. Mass.:
46756.38
Organism:
Homo sapiens (Human)
Description:
P49841
Residue:
420
  
Inhibitor
Name:
BDBM68598
Synonyms:
MLS000116375 N-(5-bromo-2-hydroxy-phenyl)-5-propyl-isoxazole-3-carboxamide N-(5-bromo-2-hydroxyphenyl)-5-propyl-3-isoxazolecarboxamide cid_5308512
Type:
Small organic molecule
Emp. Form.:
C13H13BrN2O3
Mol. Mass.:
325.158
SMILES:
CCCc1cc(no1)C(=O)Nc1cc(Br)ccc1O
: