Target
Glycogen synthase kinase-3 beta
Ligand
BDBM69089
Substrate
Meas. Tech.
Luminescence Cell-Free Homogeneous Dose Retest to Identify Inhibitors of Glycogen Synthase Kinase-3 beta Activity
EC50
14000±n/a nM
Citation
 PubChem, PC Luminescence Cell-Free Homogeneous Dose Retest to Identify Inhibitors of Glycogen Synthase Kinase-3 beta Activity PubChem Bioassay (2010)[AID] 
Target
Name:
Glycogen synthase kinase-3 beta
Synonyms:
GSK-3 beta GSK3B Glycogen synthase kinase 3 beta (GSK3B) Glycogen synthase kinase-3 beta (GSK-3B) Glycogen synthase kinase-3 beta (GSK3B) Glycogen synthase kinase-3beta (GSK3B) | Serine/threonine-protein kinase GSK3B
Type:
Enzyme
Mol. Mass.:
46756.38
Organism:
Homo sapiens (Human)
Description:
P49841
Residue:
420
  
Inhibitor
Name:
BDBM69089
Synonyms:
(6-indolin-1-yl-5-nitro-pyrimidin-4-yl)amine 6-(2,3-dihydroindol-1-yl)-5-nitro-pyrimidin-4-amine MLS000683232 cid_4438424
Type:
Small organic molecule
Emp. Form.:
C12H11N5O2
Mol. Mass.:
257.248
SMILES:
Nc1ncnc(N2CCc3ccccc23)c1[N+]([O-])=O
: