Target
Krueppel-like factor 5
Ligand
BDBM70194
Substrate
Meas. Tech.
Late stage results from the probe development effort to identify inhibitors of kruppel-like factor 5 (KLF5): luminescence-based cell-based dose response assay for inhibitors of KLF5 (Round 1)
IC50
>39841±n/a nM
Citation
 PubChem, PC Late stage results from the probe development effort to identify inhibitors of kruppel-like factor 5 (KLF5): luminescence-based cell-based dose response assay for inhibitors of KLF5 (Round 1) PubChem Bioassay (2010)[AID] 
Target
Name:
Krueppel-like factor 5
Synonyms:
BTEB2 IKLF KLF5_HUMAN | Kruppel-like factor 5
Type:
Enzyme Catalytic Domain
Mol. Mass.:
50808.71
Organism:
Homo sapiens (Human)
Description:
Q13887
Residue:
457
  
Inhibitor
Name:
BDBM70194
Synonyms:
N-[2-[(6-fluoranyl-1,3-benzothiazol-2-yl)amino]-1,3-benzothiazol-6-yl]ethanamide SR-01000096705 cid_7110041
Type:
Small organic molecule
Emp. Form.:
C16H11FN4OS2
Mol. Mass.:
358.413
SMILES:
CC(=O)Nc1ccc2nc(Nc3nc4ccc(F)cc4s3)sc2c1
: